类型
type: Class
comment: This class comprises concepts denoted by terms from thesauri and controlled vocabularies used to characterize and classify instances of CIDOC CRM classes. Instances of E55 Type represent concepts in contrast to instances of E41 Appellation which are used to name instances of CIDOC CRM classes. E55 Type is the CIDOC CRM’s interface to domain specific ontologies and thesauri. These can be represented in the CIDOC CRM as subclasses of E55 Type, forming hierarchies of terms, i.e., instances of E55 Type linked via P127 has broader term (has narrower term): E55 Type. Such hierarchies may be extended with additional properties.
label: Тип @ru
label: Tipo @pt
label: Type
label: Τύπος @el
label: Typus @de
subclass of: E28 Conceptual Object

Liste d’autorités Dénomination - Joconde
type: Dataset
uri space: http://data.culture.fr/thesaurus/resource/ark:/67717/T505

Thésaurus de la désignation des œuvres architecturales et des espaces aménagés
type: Dataset
uri space: http://data.culture.fr/thesaurus/resource/ark:/67717/T96

Thésaurus de la désignation des objets mobiliers
type: Dataset
uri space: http://data.culture.fr/thesaurus/resource/ark:/67717/T69

Liste d’autorité Typologie documentaire pour l'indexation des archives locales
type: Dataset
uri space: http://data.culture.fr/thesaurus/resource/ark:/67717/T3

Encyclopedic and Unified Alphabetical Directory of Authority-Matter (RAMEAU)
type: Dataset
uri space: http://data.bnf.fr/ark:/12148
name: Répertoire d'autorité-matière encyclopédique et alphabétique unifié (RAMEAU) @fr

DBpedia
type: Dataset
uri space: http://fr.dbpedia.org/resource
uri space: http://dbpedia.org/resource

German National Library Integrated Authority File
type: Dataset
uri space: http://d-nb.info/gnd
name: Fichier d’autorité intégré de la Bibliothèque nationale allemande @fr
name: Gemeinsame Normdatei @de

Library of Congress Subject Headings
type: Dataset
uri space: http://id.loc.gov/authorities/subjects

Wikidata
type: Dataset
uri space: http://www.wikidata.org/entity

Art and Architecture Thesaurus
type: Dataset
uri space: http://vocab.getty.edu/aat

Getty Research Institute
type: Agent
nickname: GRI

Government of Nunavut
type: Agent
name: Gouvernement du Nunavut @fr
nickname: GN

American Association for State and Local History (AASLH)
type: Agent
nickname: AASLH

Hebrew in Latin script
type: Language
type: Concept
language tag: he-latn
in scheme: Nomenclature - Languages
notation: he-latn
preferred label: hébreu en écriture latine @fr

Hebrew
type: Language
type: Concept
language tag: he
in scheme: Nomenclature - Languages
notation: he
preferred label: hébreu @fr

Ojibwa in Latin script
type: Language
type: Concept
language tag: oj-latn
alternative label: ojibwa en écriture latine @fr
alternative label: odjibwé en écriture latine @fr
alternative label: Ojibwe in Latin script
alternative label: Ojibway in Latin script
in scheme: Nomenclature - Languages
notation: oj-latn
preferred label: ojibwé en écriture latine @fr

Ojibwa
type: Language
type: Concept
language tag: oj
alternative label: ojibwa @fr
alternative label: odjibwé @fr
alternative label: Ojibwe
alternative label: Ojibway
in scheme: Nomenclature - Languages
notation: oj
preferred label: ojibwé @fr

Mohawk in Latin script
type: Language
type: Concept
language tag: moh-latn
in scheme: Nomenclature - Languages
notation: moh-latn
preferred label: mohawk en écriture latine @fr

Mohawk
type: Language
type: Concept
language tag: moh
in scheme: Nomenclature - Languages
notation: moh
preferred label: mohawk @fr

Inuktitut in Latin script
type: Language
type: Concept
language tag: iu-latn
in scheme: Nomenclature - Languages
notation: iu-latn
preferred label: inuktitut en écriture latine @fr

Iroquoian in Latin script
type: Language
type: Concept
language tag: iro-latn
in scheme: Nomenclature - Languages
notation: iro-latn
preferred label: iroquoien en écriture latine @fr

Iroquoian
type: Language
type: Concept
language tag: iro
in scheme: Nomenclature - Languages
notation: iro
preferred label: iroquoien @fr

Haida in Latin script
type: Language
type: Concept
language tag: hai-latn
in scheme: Nomenclature - Languages
notation: hai-latn
preferred label: haïda en écriture latine @fr

Haida
type: Language
type: Concept
language tag: hai
in scheme: Nomenclature - Languages
notation: hai
preferred label: haïda @fr

Cree in Latin script
type: Language
type: Concept
language tag: cr-latn
in scheme: Nomenclature - Languages
notation: cr-latn
preferred label: cri en écriture latine @fr

Nomenclature - Languages
type: ConceptScheme
title: Nomenclature - Langues @fr

nickname
type: DatatypeProperty
type: Property
comment: A short informal nickname characterising an agent (includes login identifiers, IRC and other chat nicknames).
term status: testing

name
type: DatatypeProperty
type: Property
comment: A name for some thing.
domain: Thing
range: Literal
sub property of: label
term status: testing

language tag
type: DatatypeProperty
comment: A tag para ser usada, por exemplo como valor de xml:lang. Ver https://tools.ietf.org/html/bcp47 @pt
comment: 例えばxml:langの値として、言語に用いるタグ。https://tools.ietf.org/html/bcp47を参照 @ja
comment: La etiqueta a utilizar para el lenguaje, por ejemplo como valor de xml:lang. Ver https://tools.ietf.org/html/bcp47 @es
comment: Le tag à utiliser pour la langue, par exemple comme valeur de xml:lang. Voir https://tools.ietf.org/html/bcp47 @fr
comment: The tag to use for the language, for example as value of xml:lang. See https://tools.ietf.org/html/bcp47
domain: Language
label: tag de idioma @pt
label: taal tag @nl
label: 言語タグ @ja
label: etiqueta @es
label: tag de langue @fr
sub property of: identifier

thumbnail
type: Property
comment: Thumbnail image for an image or video.
domain includes: VideoObject
domain includes: ImageObject
range includes: ImageObject

sameAs
type: Property
comment: URL of a reference Web page that unambiguously indicates the item's identity. E.g. the URL of the item's Wikipedia page, Wikidata entry, or official website.
domain includes: Thing
range includes: URL

DefinedTermSet
type: Class
comment: A set of defined terms for example a set of categories or a classification scheme, a glossary, dictionary or enumeration.
subclass of: CreativeWork
isPartOf: pending.schema.org
source: https://github.com/schemaorg/schemaorg/issues/894

Agent
type: Class
comment: An agent (eg. person, group, software or physical artifact).
equivalent class: Agent
term status: stable

Canadian Heritage Information Network (CHIN)
type: Agent
name: Réseau canadien d’information sur le patrimoine (RCIP) @fr
nickname: RCIP
nickname: CHIN

Nomenclature for Museum Cataloging Ontology
type: Ontology
comment: L'ontologie de NOM définit les valeurs utilisées dans Nomenclature pour le catalogage des objets de musée. Elle utilise les ontologies SKOS, SKOS-XL, DC, DCT, FOAF, Schema, Lexinfo, Changeset. @fr
comment: NOM Ontology defines the values used in Nomenclature for Museum Cataloging. It uses the SKOS, SKOS-XL, DC, DCT, FOAF, Schema, Lexinfo, Changeset ontologies.
label: Ontologie de Nomenclature pour le catalogage des objets de musée @fr
format: meta/rdf-schema
created: 2022-02-28
creator: Canadian Heritage Information Network (CHIN)
license: http://creativecommons.org/licenses/by/4.0/
modified: 2022-04-22
preferred namespace prefix: nomo
version info: 1.0

Organization
type: Class
comment: An organization such as a school, NGO, corporation, club, etc.
subclass of: Thing

primary topic
type: FunctionalProperty
type: ObjectProperty
type: Property
comment: The primary topic of some page or document.
domain: Document
range: Thing
inverse of: isPrimaryTopicOf
term status: stable

contentSize
type: Property
comment: File size in (mega/kilo) bytes.
domain includes: MediaObject
range includes: Text

encodingFormat
type: Property
comment: Media type typically expressed using a MIME format (see [IANA site](http://www.iana.org/assignments/media-types/media-types.xhtml) and [MDN reference](https://developer.mozilla.org/en-US/docs/Web/HTTP/Basics_of_HTTP/MIME_types)) e.g. application/zip for a SoftwareApplication binary, audio/mpeg for .mp3 etc.). In cases where a CreativeWork has several media type representations, encoding can be used to indicate each MediaObject alongside particular encodingFormat information. Unregistered or niche encoding and file formats can be indicated instead via the most appropriate URL, e.g. defining Web page or a Wikipedia/Wikidata entry.
domain includes: MediaObject
domain includes: CreativeWork
range includes: Text
range includes: URL

DataDownload
type: Class
comment: A dataset in downloadable form.
subclass of: MediaObject
source: source DatasetClass
equivalent class: Distribution

dateCreated
type: Property
comment: The date on which the CreativeWork was created or the item was added to a DataFeed.
domain includes: DataFeedItem
domain includes: CreativeWork
range includes: DateTime
range includes: Date

distribution
type: Property
comment: A downloadable form of this dataset, at a specific location, in a specific format.
domain includes: Dataset
range includes: DataDownload

keywords
type: Property
comment: Keywords or tags used to describe some item. Multiple textual entries in a keywords list are typically delimited by commas, or by repeating the property.
domain includes: Product
domain includes: Place
domain includes: Event
domain includes: Organization
domain includes: CreativeWork
range includes: DefinedTerm
range includes: Text
range includes: URL

about
type: Property
comment: The subject matter of the content.
domain includes: CommunicateAction
domain includes: Event
domain includes: CreativeWork
inverse of: subjectOf
range includes: Thing
source: https://github.com/schemaorg/schemaorg/issues/1670

publisher
type: Property
comment: The publisher of the creative work.
domain includes: CreativeWork
range includes: Person
range includes: Organization

license
type: Property
comment: A license document that applies to this content, typically indicated by URL.
domain includes: CreativeWork
range includes: URL
range includes: CreativeWork

inLanguage
type: Property
comment: The language of the content or performance or used in an action. Please use one of the language codes from the [IETF BCP 47 standard](http://tools.ietf.org/html/bcp47). See also availableLanguage.
domain includes: WriteAction
domain includes: PronounceableText
domain includes: LinkRole
domain includes: BroadcastService
domain includes: CommunicateAction
domain includes: Event
domain includes: CreativeWork
range includes: Text
range includes: Language
source: https://github.com/schemaorg/schemaorg/issues/2382

description
type: Property
comment: A description of the item.
domain includes: Thing
range includes: Text
equivalent property: description

creator
type: Property
comment: The creator/author of this CreativeWork. This is the same as the Author property for CreativeWork.
domain includes: UserComments
domain includes: CreativeWork
range includes: Person
range includes: Organization

contributor
type: Property
comment: A secondary contributor to the CreativeWork or Event.
domain includes: Event
domain includes: CreativeWork
range includes: Person
range includes: Organization

url
type: Property
comment: URL of the item.
domain includes: Thing
range includes: URL

Dataset
type: Class
comment: A body of structured information describing some topic(s) of interest.
subclass of: CreativeWork
source: source DatasetClass
equivalent class: Dataset

inverted form of
type: ObjectProperty
comment: Utilisée seulement pour les termes anglais à mots multiples @fr
comment: Used only for multi-word English labels
domain: Label
label: forme inversée de @fr
range: Label
sub property of: labelRelation
example: "Box, Drink" est la forme inversée de "Drink Box" @fr
example: "Box, Drink" is the inverted form of "Drink Box"

Move event
type: Class
comment: An event class describing that a particular resource was 'moved' in a dataset or between datasets. This means that all triples having the associated older resource as subject/object were replaced by triples having the target resource as subject/object in the corresponding RDF models.
subclass of: ResourceChangeEvent

create event
type: Class
comment: An event class describing that a particular resource was 'created' in a dataset. This means that one or more triples having the associated resource as subject or object were created in the corresponding RDF model.
subclass of: ResourceChangeEvent

source resource
type: DatatypeProperty
comment: The identifier (URI) of a resource that was published under a new URI (i.e., when a MoveEvent occurred).
domain: Move event
range: anyURI

target resource
type: DatatypeProperty
comment: The identifier (URI) of a resource that was affected by the corresponding event.
domain: ResourceChangeEvent
range: anyURI

Remove event
type: Class
comment: An event class describing that a particular resource was 'removed' from a dataset. This means that all triples having the associated resource as subject or object were removed from the corresponding RDF model.
subclass of: ResourceChangeEvent

addition
type: ObjectProperty
comment: By convention the subject of the triple being added should be the same as the subjectOfChange
domain: ChangeSet
range: Statement
sub property of: statement
issued: 2005-12-14
change note: Added definitition and documentation
  creator: Ian Davis
  date: 2006-03-21
definition: a triple to be added to the resource description
history note: Made owl:ObjectProperty
  creator: Ian Davis
  date: 2006-03-21
history note: Made a sub-property of statement
  creator: Ian Davis
  date: 2006-03-21

removal
type: ObjectProperty
comment: By convention the subject of the triple being removed should be the same as the subjectOfChange
domain: ChangeSet
range: Statement
sub property of: statement
issued: 2005-12-14
change note: Added definitition and documentation
  creator: Ian Davis
  date: 2006-03-21
definition: a triple to be removed from the resource description
history note: Made a sub-property of statement
  creator: Ian Davis
  date: 2006-03-21
history note: Made owl:ObjectProperty
  creator: Ian Davis
  date: 2006-03-21

subjectOfChange
type: ObjectProperty
domain: ChangeSet
range: Resource
issued: 2005-12-14
change note: Added definitition and documentation
  creator: Ian Davis
  date: 2006-03-21
definition: the resource to which this set of changes applies
history note: Made owl:ObjectProperty
  creator: Ian Davis
  date: 2006-03-21

createdDate
type: DatatypeProperty
comment: The date should be in W3CDTF format
domain: ChangeSet
sub property of: date
issued: 2005-12-14
definition: the date that the changeset was created
history note: Made owl:DatatypeProperty
  creator: Ian Davis
  date: 2006-03-21

Update event
type: Class
comment: An event class describing that a particular resource was 'updated' in a dataset. This means that some triples having the associated resource as subject or object were modified/created/removed in the corresponding RDF model.
subclass of: ResourceChangeEvent

ChangeSet
type: Class
subclass of: Class
  intersection of: Restriction
    min cardinality: 1
    on property: statement
  intersection of: Restriction
    max cardinality: 1
    on property: previousChangeSet
  intersection of: Restriction
    max cardinality: 1
    on property: subjectOfChange
  intersection of: Restriction
    max cardinality: 1
    on property: createdDate
  intersection of: Restriction
    max cardinality: 1
    on property: creatorName
  intersection of: Restriction
    max cardinality: 1
    on property: changeReason
issued: 2005-12-14
change note: Improved documentation
  creator: Ian Davis
  date: 2006-03-21
definition: The encapsulation of a delta between two versions of a resource description
history note: Added property cardinality restrictions
  creator: Ian Davis
  date: 2006-03-21

Inuktitut
type: Language
type: Concept
language tag: iu
in scheme: Nomenclature - Languages
notation: iu
preferred label: inuktitut @fr

Canadian English
type: Language
type: Concept
language tag: en-ca
in scheme: Nomenclature - Languages
notation: en-ca
preferred label: anglais canadien @fr

Spanish
type: Language
type: Concept
language tag: es
in scheme: Nomenclature - Languages
notation: es
preferred label: espagnol @fr

Cree
type: Language
type: Concept
language tag: cr
in scheme: Nomenclature - Languages
notation: cr
preferred label: cri @fr

Canadian French
type: Language
type: Concept
language tag: fr-ca
in scheme: Nomenclature - Languages
notation: fr-ca
preferred label: français canadien @fr

Category
type: Collection
position: 1
definition: Premier niveau de la hiérarchie, contenant le niveau le plus générique du regroupement d’objets par contexte fonctionnel. @fr
definition: Top level of the Nomenclature hierarchy, containing the broadest level of object grouping by functional context.
preferred label: Catégorie @fr

Class
type: Collection
position: 2
definition: Deuxième niveau de la hiérarchie de Nomenclature. @fr
definition: Second level of the Nomenclature hierarchy.
preferred label: Classe @fr

Subclass
type: Collection
position: 3
definition: Troisième niveau de la hiérarchie de Nomenclature. @fr
definition: Third level of the Nomenclature Hierarchy.
preferred label: Sous-classe @fr

Primary Term
type: Collection
position: 4
definition: Quatrième niveau de la hiérarchie de Nomenclature, contenant le nom d’objet le plus générique. @fr
definition: Fourth level of the Nomenclature Hierarchy, containing the most general object names.
preferred label: Terme primaire @fr

masculine
type: gender
comment: De, relatif à, ou constituant le genre qui inclut habituellement la plupart des mots ou formes grammaticales se référant aux hommes. @fr
comment: Of, relating to, or constituting the gender that ordinarily includes most words or grammatical forms referring to males.
label: masculin @fr

Tertiary Term
type: Collection
position: 6
definition: Sixième niveau de la hiérarchie de Nomenclature. @fr
definition: Sixth level of the Nomenclature Hierarchy.
preferred label: Terme tertiaire @fr

creditText
type: Property
comment: Text that can be used to credit person(s) and/or organization(s) associated with a published Creative Work.
domain includes: CreativeWork
isPartOf: pending.schema.org
range includes: Text
source: https://github.com/schemaorg/schemaorg/issues/2659

thumbnailUrl
type: Property
comment: A thumbnail image relevant to the Thing.
domain includes: CreativeWork
range includes: URL

contentUrl
type: Property
comment: Actual bytes of the media object, for example the image file or video file.
domain includes: MediaObject
range includes: URL

ImageObject
type: Class
comment: An image file.
subclass of: MediaObject
equivalent class: Image

image
type: Property
comment: An image of the item. This can be a URL or a fully described ImageObject.
domain includes: Thing
range includes: URL
range includes: ImageObject

alternateName
type: Property
comment: An alias for the item.
domain includes: Thing
range includes: Text

gender
type: Class
prior version: Gender

feminine
type: gender
comment: De, relatif à, ou constituant le genre qui inclut habituellement la plupart des mots ou formes grammaticales se référant aux femmes. @fr
comment: Of, relating to, or constituting the gender that ordinarily includes most words or grammatical forms referring to females.
label: féminin @fr

citation
type: Property
comment: A citation or reference to another creative work, such as another publication, web page, scholarly article, etc.
domain includes: CreativeWork
range includes: Text
range includes: CreativeWork

name
type: Property
comment: The name of the item.
sub property of: label
domain includes: Thing
range includes: Text
equivalent property: title

French
type: Language
type: Concept
language tag: fr
in scheme: Nomenclature - Languages
notation: fr
preferred label: français @fr

inverted terms
type: Concept
definition: Termes à mots multiples qui sont organisés selon la forme utilisée lors de l'indexation à la fin des livres en anglais ou lors de situations similaires. Des exemples sont « Chair, Rocking » et « Dress, Wedding ». Se distingue des termes en ordre naturel. @fr
definition: Multiple-word terms that are arranged in the form used in back-of-book indexing or other similar situations. Examples are "Chair, Rocking" and "Dress, Wedding". Distinguished from natural order terms.
example: Chair, Barber's
preferred label: Termes inversés @fr
scope note: Utilisé seulement pour les termes à mots multiples en anglais. @fr
scope note: Used only for English multi-word terms.

natural order terms
type: Concept
definition: Termes à mots multiples qui sont organisés selon la forme utilisée à l'expression orale ou à l'écrit en anglais. Des exemples sont « Rocking Chair » et « Wedding Dress ». Se distingue des termes inversés. @fr
definition: Multiple-word terms or names that are arranged in the form used in speech or written text. Examples are "Rocking Chair" and "Wedding Dress". Distinguished from inverted terms.
example: Barber's Chair
preferred label: Termes en ordre naturel @fr
scope note: Utilisé seulement pour les termes en anglais (pour les unitermes et ceux à mots multiples). @fr
scope note: Used only for English terms (both single-word and multi-word)

Language
type: Class
comment: Um idioma utilizado na comunicação oral ou escrita entre pessoas, ou na que se escreve ou grava um recurso. Recomenda-se a utilização das instâncias definidas segundo os códigos ISO 639, como os que aparecem nos excemplos @pt
comment: 会話または記述による人間のコミュニケーションで使用される言語、または資源が記述または記録される言語。例にあるような、ISO 639コードに基づいて定義されたインスタンスを使用することが推奨される @ja
comment: Een taal gebruikt in geschreven of gesproken communicatie tussen mensen of in welke een bron is geschreven of opgenomen. Het is aan te raden instanties te gebruiken gedefinieerd op basis van de ISO 630 codes, zoals in deze voorbeelden @nl
comment: Une langue utilisée dans la communication orale ou écrite entre humains, ou dans laquelle une ressource est écrite ou enregistrée. Il est recommandé d'utiliser des instances définies sur la base d'un code ISO 639, comme dans les exemples @fr
comment: Una lengua utilizada en la comunicación oral o escrita entre personas, o en la que se escribe o graba un recurso. Se recomienda el uso de las instancias definidas según los códigos ISO 639, como los que aparecen en los ejemplos @es
comment: A language used in spoken or written human communication, or in which a resource is written or recorded. It is recommended to use instances defined on the basis of ISO 639 codes, such as those in examples
label: 语言 @zh
label: Sprache @de
label: Lingvo @eo
label: Lenguaje @es
label: Kieli @fi
label: Langue @fr
label: Linguaggio @it
label: 言語 @ja
label: Taal @nl
label: Språk @no
label: Jezyk @pl
label: Idioma @pt
label: Язык @ru
label: Dil @tr
subclass of: Language
subclass of: LinguisticSystem
somewhat same as: Language
example: ja
example: fra
equivalent class: Language

English
type: Language
type: Concept
language tag: en
in scheme: Nomenclature - Languages
notation: en
preferred label: anglais @fr

value
type: Property
comment: The value of the quantitative value or property value node.\n\n* For QuantitativeValue and MonetaryAmount, the recommended type for values is 'Number'.\n* For PropertyValue, it can be 'Text;', 'Number', 'Boolean', or 'StructuredValue'.\n* Use values from 0123456789 (Unicode 'DIGIT ZERO' (U+0030) to 'DIGIT NINE' (U+0039)) rather than superficially similiar Unicode symbols.\n* Use '.' (Unicode 'FULL STOP' (U+002E)) rather than ',' to indicate a decimal point. Avoid using these symbols as a readability separator.
domain includes: QuantitativeValue
domain includes: PropertyValue
domain includes: MonetaryAmount
range includes: Number
range includes: Boolean
range includes: Text
range includes: StructuredValue
source: source GoodRelationsTerms

StructuredValue
type: Class
comment: Structured values are used when the value of a property has a more complex structure than simply being a textual value or a reference to another thing.
subclass of: Intangible

position
type: Property
comment: The position of an item in a series or sequence of items.
domain includes: ListItem
domain includes: CreativeWork
range includes: Integer
range includes: Text

Collection
type: Class
comment: A collection of items e.g. creative works or products.
subclass of: CreativeWork
isPartOf: bib.schema.org

Secondary Term
type: Collection
position: 5
definition: Cinquième niveau de la hiérarchie de Nomenclature. @fr
definition: Fifth level of the Nomenclature Hierarchy.
preferred label: Terme secondaire @fr

isPartOf
type: Property
comment: Indicates an item or CreativeWork that this item, or CreativeWork (in some sense), is part of.
domain includes: CreativeWork
inverse of: hasPart
range includes: URL
range includes: CreativeWork

CreativeWork
type: Class
comment: The most generic kind of creative work, including books, movies, photographs, software programs, etc.
subclass of: Thing
source: source rNews